{"text_format":"1","workbook":"xlsx","n_sheets":19,"sheets":["Start","S 0-5","S 5-10","S 0-10","S 10-15","S 15-20","S 10-20","S 0-20","Brug over 10","E+E","T+E","TE + E","O gemengd","E-E","T - E","Brug over 10 min","TE - T","TE - TE","A gemengd"],"not_rendered":{"charts":0,"images":18,"macros":1,"external_links":0,"defined_names":0,"comments":0,"pivot_tables":0},"unopened":[],"bounds":{"document_bytes":16777216,"sheet_cells":100000,"rows_first":2000,"rows_last":500,"rows_between":2000,"halvings":0,"cell_chars":16384,"cell_head_chars":4096},"cells_cut":0,"cells_raw":0,"read":"whole","date_system":"1900"}

{"sheet":"Start","index":0,"n_rows":27,"n_cols":10,"rows_kept":27,"cut":false,"hidden":false,"merged":[[5,1,6,3],[5,5,6,7],[5,9,6,11],[1,1,3,11]]}
[]
[null,"Rekenen tot 20"]
[]
[]
[]
[null,"SPLITSEN ",null,null,null,"OPTELLEN",null,null,null,"AFTREKKEN"]
[]
[]
[]
[]
[]
[]
[]
[]
[]
[]
[]
[]
[]
[]
[]
[]
[]
[]
[]
[null,"Uitgewerkt door Level21",null,null,null,null,"oktober 2017"]
[null,null,null,null,null,null,"gemaakt door Liesbeth Vermant :)"]

{"sheet":"S 0-5","index":1,"n_rows":20,"n_cols":16,"rows_kept":20,"cut":false,"hidden":false,"merged":[[17,1,17,4],[1,1,1,8],[19,1,19,8],[18,1,18,6]]}
[null,null,null,null,null,null,null,null,null,null,"."]
[null,"Splitsen 1 tot 5"]
[null,null,null,null,null,null,null,null,null,null,"tafel van 1",null,"tafel van 2",null,"tafel van 3"]
[]
[null,1,".",null,2,".",null,1,".",null,0,{"$f":"IF(C5=K5,\"juist\",IF(C5=\".\",\"vul in\",\"fout\"))","v":"vul in"},0,{"$f":"IF(F5=M5,\"juist\",IF(F5=\".\",\"vul in\",\"fout\"))","v":"vul in"},2,{"$f":"IF(I5=O5,\"juist\",IF(I5=\".\",\"vul in\",\"fout\"))","v":"vul in"}]
[null,0,".",null,0,".",null,0,".",null,1,{"$f":"IF(C6=K6,\"juist\",IF(C6=\".\",\"vul in\",\"fout\"))","v":"vul in"},2,{"$f":"IF(F6=M6,\"juist\",IF(F6=\".\",\"vul in\",\"fout\"))","v":"vul in"},3,{"$f":"IF(I6=O6,\"juist\",IF(I6=\".\",\"vul in\",\"fout\"))","v":"vul in"}]
[null,null,{"$f":"IF(L7=2,\"Prima!\",IF(L8>=1,\"Oeps!\",\"\"))","v":""},null,1,".",null,3,".",null,null,{"$f":"COUNTIF(L5:L6,\"juist\")","v":0},1,"vul in",0,"vul in"]
[null,null,null,null,null,{"$f":"IF(N8=3,\"Prima!\",IF(N9>=1,\"Oeps!\",\"\"))","v":""},null,2,".",null,null,{"$f":"COUNTIF(L5:L6,\"fout\")","v":0},null,{"$f":"COUNTIF(N5:N7,\"juist\")","v":0},1,"vul in"]
[null,null,null,null,null,null,null,null,{"$f":"IF(P9=4,\"Prima!\",IF(P10>=1,\"Oeps!\",\"\"))","v":""},null,"tafel van 4",null,"tafel van 5",{"$f":"COUNTIF(N5:N7,\"fout\")","v":0},null,{"$f":"COUNTIF(P5:P8,\"juist\")","v":0}]
[null,null,null,null,null,null,null,null,null,null,0,{"$f":"IF(C11=K10,\"juist\",IF(C11=\".\",\"vul in\",\"fout\"))","v":"vul in"},4,{"$f":"IF(F11=M10,\"juist\",IF(F11=\".\",\"vul in\",\"fout\"))","v":"vul in"},null,{"$f":"COUNTIF(P5:P8,\"fout\")","v":0}]
[null,4,".",null,1,".",null,null,null,null,3,{"$f":"IF(C12=K11,\"juist\",IF(C12=\".\",\"vul in\",\"fout\"))","v":"vul in"},2,{"$f":"IF(F12=M11,\"juist\",IF(F12=\".\",\"vul in\",\"fout\"))","v":"vul in"}]
[null,1,".",null,3,".",null,null,null,null,4,"vul in",1,"vul in"]
[null,0,".",null,4,".",null,null,null,null,2,"vul in",5,"vul in"]
[null,2,".",null,0,".",null,null,null,null,1,"vul in",0,"vul in"]
[null,3,".",null,5,".",null,null,null,null,null,{"$f":"COUNTIF(L10:L14,\"juist\")","v":0},3,"vul in"]
[null,null,{"$f":"IF(L15=5,\"Prima!\",IF(L16>=1,\"Oeps!\",\"\"))","v":""},null,2,".",null,null,null,null,null,{"$f":"COUNTIF(L10:L14,\"fout\")","v":0},null,{"$f":"COUNTIF(N10:N15,\"juist\")","v":0}]
[null,null,null,null,null,{"$f":"IF(N16=6,\"Prima!\",IF(N17>=1,\"Oeps!\",\"\"))","v":""},null,null,null,null,null,null,null,{"$f":"COUNTIF(N10:N15,\"fout\")","v":0}]
[]
[null,"Totaal aantal punten ",null,null,null,null,null,{"$f":"L7+N8+P9+L15+N16","v":0},"/20"]
[null,{"$f":"IF(F16=\".\",\"\",IF(H19<12,\"jammer, probeer nog een keer\",IF(H19<16,\"dit kan beter\",IF(H19=16,\"proficiat, dit heb je goed gedaan!\",IF(H19>16,\"proficiat, dit heb je goed gedaan!\",)))))","v":""}]

{"sheet":"S 5-10","index":2,"n_rows":19,"n_cols":25,"rows_kept":19,"cut":false,"hidden":false,"merged":[[16,1,16,4],[1,1,1,14],[18,1,18,14],[17,1,17,12]]}
[]
[null,"Splitsen 5 tot 10"]
[]
[null,null,null,null,null,null,null,null,null,null,null,null,null,null,null,6,null,7,null,8,null,9,null,10]
[null,3,".",null,5,".",null,2,".",null,0,".",null,1,".",3,{"$f":"IF(C5=P5,\"juist\",IF(C5=\".\",\"vul in\",\"fout\"))","v":"vul in"},2,{"$f":"IF(F5=R5,\"juist\",IF(F5=\".\",\"vul in\",\"fout\"))","v":"vul in"},6,{"$f":"IF(I5=T5,\"juist\",IF(I5=\".\",\"vul in\",\"fout\"))","v":"vul in"},9,{"$f":"IF(L5=V5,\"juist\",IF(L5=\".\",\"vul in\",\"fout\"))","v":"vul in"},9,{"$f":"IF(O5=X5,\"juist\",IF(O5=\".\",\"vul in\",\"fout\"))","v":"vul in"}]
[null,1,".",null,2,".",null,8,".",null,5,".",null,9,".",5,{"$f":"IF(C6=P6,\"juist\",IF(C6=\".\",\"vul in\",\"fout\"))","v":"vul in"},5,{"$f":"IF(F6=R6,\"juist\",IF(F6=\".\",\"vul in\",\"fout\"))","v":"vul in"},0,{"$f":"IF(I6=T6,\"juist\",IF(I6=\".\",\"vul in\",\"fout\"))","v":"vul in"},4,{"$f":"IF(L6=V6,\"juist\",IF(L6=\".\",\"vul in\",\"fout\"))","v":"vul in"},1,{"$f":"IF(O6=X6,\"juist\",IF(O6=\".\",\"vul in\",\"fout\"))","v":"vul in"}]
[null,2,".",null,4,".",null,3,".",null,9,".",null,5,".",4,"vul in",3,"vul in",5,"vul in",0,"vul in",5,"vul in"]
[null,5,".",null,1,".",null,6,".",null,2,".",null,3,".",1,"vul in",6,"vul in",2,"vul in",7,"vul in",7,"vul in"]
[null,0,".",null,3,".",null,0,".",null,3,".",null,10,".",6,"vul in",4,"vul in",8,"vul in",6,"vul in",0,"vul in"]
[null,6,".",null,7,".",null,4,".",null,8,".",null,0,".",0,"vul in",0,"vul in",4,"vul in",1,"vul in",10,"vul in"]
[null,4,".",null,0,".",null,1,".",null,1,".",null,6,".",2,"vul in",7,"vul in",7,"vul in",8,"vul in",4,"vul in"]
[null,null,{"$f":"IF(Q12=7,\"Prima!\",IF(Q13>=1,\"Oeps!\",\"\"))","v":""},null,6,".",null,5,".",null,7,".",null,8,".",null,{"$f":"COUNTIF(Q5:Q11,\"juist\")","v":0},1,"vul in",3,"vul in",2,"vul in",2,"vul in"]
[null,null,null,null,null,{"$f":"IF(S13=8,\"Prima!\",IF(S14>=1,\"Oeps!\",\"\"))","v":""},null,7,".",null,4,".",null,2,".",null,{"$f":"COUNTIF(Q5:Q11,\"fout\")","v":0},null,{"$f":"COUNTIF(S5:S12,\"juist\")","v":0},1,"vul in",5,"vul in",8,"vul in"]
[null,null,null,null,null,null,null,null,{"$f":"IF(U14=9,\"prima!\",IF(U15>=1,\"Oeps!\",\"\"))","v":""},null,6,".",null,4,".",null,null,null,{"$f":"COUNTIF(S5:S12,\"fout\")","v":0},null,{"$f":"COUNTIF(U5:U13,\"juist\")","v":0},3,"vul in",6,"vul in"]
[null,null,null,null,null,null,null,null,null,null,null,{"$f":"IF(W15=10,\"prima!\",IF(W16>=1,\"Oeps!\",\"\"))","v":""},null,7,".",null,null,null,null,null,{"$f":"COUNTIF(U5:U13,\"fout\")","v":0},null,{"$f":"COUNTIF(W5:W14,\"juist\")","v":0},3,"vul in"]
[null,null,null,null,null,null,null,null,".",null,null,null,null,null,{"$f":"IF(Y16=11,\"prima!\",IF(Y17>=1,\"Oeps!\",\"\"))","v":""},null,null,null,null,null,null,null,{"$f":"COUNTIF(W5:W14,\"fout\")","v":0},null,{"$f":"COUNTIF(Y5:Y15,\"juist\")","v":0}]
[null,null,null,null,null,".",null,null,null,null,null,null,null,null,null,null,null,null,null,null,null,null,null,null,{"$f":"COUNTIF(Y5:Y15,\"fout\")","v":0}]
[null,"Totaal aantal punten ",null,null,null,null,null,null,null,null,null,null,null,{"$f":"Q12+S13+U14+W15+Y16","v":0},"/45"]
[null,{"$f":"IF(O15=\".\",\"\",IF(N18<27,\"jammer, probeer nog een keer\",IF(N18<36,\"dit kan beter\",IF(N18=36,\"proficiat, dit heb je goed gedaan!\",IF(N18>36,\"proficiat, dit heb je goed gedaan!\",)))))","v":""}]

{"sheet":"S 0-10","index":3,"n_rows":30,"n_cols":18,"rows_kept":30,"cut":false,"hidden":false,"merged":[[19,1,19,4],[1,1,1,17],[20,7,20,15],[21,7,21,17]]}
[]
[null,"Splitsen 0 tot 10"]
[]
[]
[null,0,".",null,1,".",null,2,".",null,0,".",null,0,".",null,0,"."]
[]
[]
[null,2,".",null,3,".",null,3,".",null,6,".",null,1,".",null,2,"."]
[]
[]
[null,3,".",null,4,".",null,1,".",null,3,".",null,5,".",null,1,"."]
[]
[]
[null,1,".",null,5,".",null,3,".",null,0,".",null,5,".",null,1,"."]
[]
[]
[null,6,".",null,7,".",null,1,".",null,2,".",null,1,".",null,5,"."]
[]
[null,null,{"$f":"IF(C29=5,\"Prima!\",IF(C30>=1,\"Oeps!\",\"\"))","v":""},null,null,{"$f":"IF(F29=5,\"Prima!\",IF(F30>=1,\"Oeps!\",\"\"))","v":""},null,null,{"$f":"IF(I29=5,\"Prima!\",IF(I30>=1,\"Oeps!\",\"\"))","v":""},null,null,{"$f":"IF(L29=5,\"Prima!\",IF(L30>=1,\"Oeps!\",\"\"))","v":""},null,null,{"$f":"IF(O29=5,\"Prima!\",IF(O30>=1,\"Oeps!\",\"\"))","v":""},null,null,{"$f":"IF(R29=5,\"Prima!\",IF(R30>=1,\"Oeps!\",\"\"))","v":""}]
[]
[null,null,null,null,null,null,null,"Totaal aantal punten ",null,null,null,null,null,null,null,null,{"$f":"C29+F29+I29+L29+O29+R29","v":0},"/30"]
[null,null,null,null,null,null,null,{"$f":"IF(R17=\".\",\"\",IF(Q21<18,\"jammer, probeer nog een keer\",IF(Q21<24,\"dit kan beter\",IF(Q21=24,\"proficiat, dit heb je goed gedaan!\",IF(Q21>24,\"proficiat, dit heb je goed gedaan!\",)))))","v":""}]
[]
[null,1,{"$f":"IF(C5=B24, \"juist\", IF(C5=\".\",\"\",\"fout\"))","v":""},null,1,{"$f":"IF(F5=E24, \"juist\", IF(F5=\".\",\"\",\"fout\"))","v":""},null,7,{"$f":"IF(I5=H24, \"juist\", IF(I5=\".\",\"\",\"fout\"))","v":""},null,10,{"$f":"IF(L5=K24, \"juist\", IF(L5=\".\",\"\",\"fout\"))","v":""},null,0,{"$f":"IF(O5=N24, \"juist\", IF(O5=\".\",\"\",\"fout\"))","v":""},null,2,{"$f":"IF(R5=Q24, \"juist\", IF(R5=\".\",\"\",\"fout\"))","v":""}]
[null,1,{"$f":"IF(C8=B25, \"juist\", IF(C8=\".\",\"\",\"fout\"))","v":""},null,1,{"$f":"IF(F8=E25, \"juist\", IF(F8=\".\",\"\",\"fout\"))","v":""},null,4,{"$f":"IF(I8=H25, \"juist\", IF(I8=\".\",\"\",\"fout\"))","v":""},null,2,{"$f":"IF(L8=K25, \"juist\", IF(L8=\".\",\"\",\"fout\"))","v":""},null,2,{"$f":"IF(O8=N25, \"juist\", IF(O8=\".\",\"\",\"fout\"))","v":""},null,2,{"$f":"IF(R8=Q25, \"juist\", IF(R8=\".\",\"\",\"fout\"))","v":""}]
[null,2,{"$f":"IF(C11=B26, \"juist\", IF(C11=\".\",\"\",\"fout\"))","v":""},null,2,{"$f":"IF(F11=E26, \"juist\", IF(F11=\".\",\"\",\"fout\"))","v":""},null,4,{"$f":"IF(I11=H26, \"juist\", IF(I11=\".\",\"\",\"fout\"))","v":""},null,3,{"$f":"IF(L11=K26, \"juist\", IF(L11=\".\",\"\",\"fout\"))","v":""},null,0,{"$f":"IF(O11=N26, \"juist\", IF(O11=\".\",\"\",\"fout\"))","v":""},null,5,{"$f":"IF(R11=Q26, \"juist\", IF(R11=\".\",\"\",\"fout\"))","v":""}]
[null,6,{"$f":"IF(C14=B27, \"juist\", IF(C14=\".\",\"\",\"fout\"))","v":""},null,3,{"$f":"IF(F14=E27, \"juist\", IF(F14=\".\",\"\",\"fout\"))","v":""},null,0,{"$f":"IF(I14=H27, \"juist\", IF(I14=\".\",\"\",\"fout\"))","v":""},null,4,{"$f":"IF(L14=K27, \"juist\", IF(L14=\".\",\"\",\"fout\"))","v":""},null,2,{"$f":"IF(O14=N27, \"juist\", IF(O14=\".\",\"\",\"fout\"))","v":""},null,7,{"$f":"IF(R14=Q27, \"juist\", IF(R14=\".\",\"\",\"fout\"))","v":""}]
[null,3,{"$f":"IF(C17=B28, \"juist\", IF(C17=\".\",\"\",\"fout\"))","v":""},null,3,{"$f":"IF(F17=E28, \"juist\", IF(F17=\".\",\"\",\"fout\"))","v":""},null,0,{"$f":"IF(I17=H28, \"juist\", IF(I17=\".\",\"\",\"fout\"))","v":""},null,0,{"$f":"IF(L17=K28, \"juist\", IF(L17=\".\",\"\",\"fout\"))","v":""},null,8,{"$f":"IF(O17=N28, \"juist\", IF(O17=\".\",\"\",\"fout\"))","v":""},null,5,{"$f":"IF(R17=Q28, \"juist\", IF(R17=\".\",\"\",\"fout\"))","v":""}]
[null,null,{"$f":"COUNTIF(C24:C28,\"juist\")","v":0},null,null,{"$f":"COUNTIF(F24:F28,\"juist\")","v":0},null,null,{"$f":"COUNTIF(I24:I28,\"juist\")","v":0},null,null,{"$f":"COUNTIF(L24:L28,\"juist\")","v":0},null,null,{"$f":"COUNTIF(O24:O28,\"juist\")","v":0},null,null,{"$f":"COUNTIF(R24:R28,\"juist\")","v":0}]
[null,null,{"$f":"COUNTIF(C24:C28,\"fout\")","v":0},null,null,{"$f":"COUNTIF(F24:F28,\"fout\")","v":0},null,null,{"$f":"COUNTIF(I24:I28,\"fout\")","v":0},null,null,{"$f":"COUNTIF(L24:L28,\"fout\")","v":0},null,null,{"$f":"COUNTIF(O24:O28,\"fout\")","v":0},null,null,{"$f":"COUNTIF(R24:R28,\"fout\")","v":0}]

{"sheet":"S 10-15","index":4,"n_rows":26,"n_cols":16,"rows_kept":26,"cut":false,"hidden":false,"merged":[[1,1,2,8],[24,1,24,6],[25,1,25,8]]}
[]
[null,"Splitsen 10 tot 15"]
[]
[null,null,null,null,null,null,null,null,null,null,10,null,15,null,12]
[null,null,null,null,null,null,null,null,null,null,7,{"$f":"IF(C7=K5,\"juist\",IF(C7=\".\",\"vul in\",\"fout\"))","v":"vul in"},3,{"$f":"IF(F6=M5,\"juist\",IF(F6=\".\",\"vul in\",\"fout\"))","v":"vul in"},8,{"$f":"IF(I6=O5,\"juist\",IF(I6=\".\",\"vul in\",\"fout\"))","v":"vul in"}]
[null,null,null,null,12,".",null,4,".",null,4,{"$f":"IF(C8=K6,\"juist\",IF(C8=\".\",\"vul in\",\"fout\"))","v":"vul in"},7,{"$f":"IF(F7=M6,\"juist\",IF(F7=\".\",\"vul in\",\"fout\"))","v":"vul in"},12,{"$f":"IF(I7=O6,\"juist\",IF(I7=\".\",\"vul in\",\"fout\"))","v":"vul in"}]
[null,3,".",null,8,".",null,0,".",null,2,{"$f":"IF(C9=K7,\"juist\",IF(C9=\".\",\"vul in\",\"fout\"))","v":"vul in"},13,"vul in",6,"vul in"]
[null,6,".",null,2,".",null,6,".",null,5,{"$f":"IF(C10=K8,\"juist\",IF(C10=\".\",\"vul in\",\"fout\"))","v":"vul in"},15,"vul in",3,"vul in"]
[null,8,".",null,0,".",null,9,".",null,null,{"$f":"COUNTIF(L5:L8,\"juist\")","v":0},11,"vul in",11,"vul in"]
[null,5,".",null,4,".",null,1,".",null,null,{"$f":"COUNTIF(L5:L7,\"fout\")","v":0},6,"vul in",7,"vul in"]
[null,null,{"$f":"IF(L9=4,\"Prima!\",IF(L10>=1,\"Oeps!\",\"\"))","v":""},null,9,".",null,5,".",null,null,null,1,"vul in",2,"vul in"]
[null,null,null,null,14,".",null,10,".",null,null,null,5,"vul in",null,{"$f":"COUNTIF(P5:P11,\"juist\")","v":0}]
[null,null,null,null,10,".",null,null,{"$f":"IF(P12=7,\"Prima!\",IF(P13>=1,\"Oeps!\",\"\"))","v":""},null,null,null,null,{"$f":"COUNTIF(N5:N12,\"juist\")","v":0},null,{"$f":"COUNTIF(P5:P11,\"fout\")","v":0}]
[null,null,null,null,null,{"$f":"IF(N13=8,\"Prima!\",IF(N14>=1,\"Oeps!\",\"\"))","v":""},null,null,null,null,null,null,null,{"$f":"COUNTIF(N5:N12,\"fout\")","v":0}]
[null,3,".",null,null,null,null,null,null,null,14,null,11,null,13]
[null,6,".",null,null,null,null,13,".",null,11,{"$f":"IF(C15=K16,\"juist\",IF(C15=\".\",\"vul in\",\"fout\"))","v":"vul in"},8,{"$f":"IF(F17=M16,\"juist\",IF(F17=\".\",\"vul in\",\"fout\"))","v":"vul in"},0,{"$f":"IF(I16=O16,\"juist\",IF(I16=\".\",\"vul in\",\"fout\"))","v":"vul in"}]
[null,12,".",null,3,".",null,5,".",null,8,{"$f":"IF(C16=K17,\"juist\",IF(C16=\".\",\"vul in\",\"fout\"))","v":"vul in"},5,"vul in",8,{"$f":"IF(I17=O17,\"juist\",IF(I17=\".\",\"vul in\",\"fout\"))","v":"vul in"}]
[null,4,".",null,6,".",null,11,".",null,2,"vul in",10,"vul in",2,"vul in"]
[null,9,".",null,1,".",null,3,".",null,10,"vul in",4,"vul in",10,"vul in"]
[null,7,".",null,7,".",null,4,".",null,5,"vul in",0,"vul in",9,"vul in"]
[null,1,".",null,11,".",null,7,".",null,7,"vul in",2,"vul in",6,"vul in"]
[null,14,".",null,9,".",null,1,".",null,13,"vul in",null,{"$f":"COUNTIF(N16:N21,\"juist\")","v":0},12,"vul in"]
[null,null,{"$f":"IF(L24=8,\"Prima!\",IF(L25>=1,\"Oeps!\",\"\"))","v":""},null,null,{"$f":"IF(N22=6,\"Prima!\",IF(N23>=1,\"Oeps!\",\"\"))","v":""},null,null,{"$f":"IF(P23=7,\"Prima!\",IF(P24>=1,\"Oeps!\",\"\"))","v":""},null,0,"vul in",null,{"$f":"COUNTIF(N16:N21,\"fout\")","v":0},null,{"$f":"COUNTIF(P16:P22,\"juist\")","v":0}]
[null,null,null,null,null,null,null,null,null,null,null,{"$f":"COUNTIF(L16:L23,\"juist\")","v":0},null,null,null,{"$f":"COUNTIF(P16:P22,\"fout\")","v":0}]
[null,"totaal aantal punten",null,null,null,null,null,{"$f":"L9+N13+P12+L24+N22+P23","v":0},"/40",null,null,{"$f":"COUNTIF(L16:L23,\"fout\")","v":0}]
[null,{"$f":"IF(I22=\".\",\"\",IF(H25<24,\"jammer, probeer nog een keer\",IF(H25<32,\"dit kan beter\",IF(H25=32,\"proficiat, dit heb je goed gedaan!\",IF(H25>32,\"proficiat, dit heb je goed gedaan!\",)))))","v":""}]

{"sheet":"S 15-20","index":5,"n_rows":30,"n_cols":22,"rows_kept":30,"cut":false,"hidden":false,"merged":[[1,1,2,14],[20,4,20,12],[21,4,21,14]]}
[]
[null,"Splitsen 15 tot 20"]
[]
[null,null,null,null,null,null,null,null,null,null,null,null,null,null,null,null,null,16,null,17,null,18]
[null,null,null,null,null,null,null,null,null,null,null,null,null,null,null,null,9,{"$f":"IF(C7=Q5,\"juist\",IF(C7=\".\",\"vul in\",\"fout\"))","v":"vul in"},14,{"$f":"IF(F7=S5,\"juist\",IF(F7=\".\",\"vul in\",\"fout\"))","v":"vul in"},7,{"$f":"IF(I7=U5,\"juist\",IF(I7=\".\",\"vul in\",\"fout\"))","v":"vul in"}]
[null,null,null,null,null,null,null,null,null,null,null,null,null,null,null,null,2,{"$f":"IF(C8=Q6,\"juist\",IF(C8=\".\",\"vul in\",\"fout\"))","v":"vul in"},8,{"$f":"IF(F8=S6,\"juist\",IF(F8=\".\",\"vul in\",\"fout\"))","v":"vul in"},2,{"$f":"IF(I8=U6,\"juist\",IF(I8=\".\",\"vul in\",\"fout\"))","v":"vul in"}]
[null,7,".",null,3,".",null,11,".",null,10,".",null,15,".",null,12,"vul in",1,"vul in",9,"vul in"]
[null,14,".",null,9,".",null,16,".",null,15,".",null,2,".",null,0,"vul in",12,"vul in",0,"vul in"]
[null,4,".",null,16,".",null,9,".",null,3,".",null,12,".",null,6,"vul in",10,"vul in",15,"vul in"]
[null,16,".",null,5,".",null,18,".",null,17,".",null,0,".",null,13,"vul in",4,"vul in",12,"vul in"]
[null,10,".",null,7,".",null,3,".",null,12,".",null,7,".",null,15,"vul in",17,"vul in",17,"vul in"]
[null,3,".",null,13,".",null,6,".",null,4,".",null,16,".",null,5,"vul in",15,"vul in",5,"vul in"]
[null,1,".",null,0,".",null,1,".",null,18,".",null,10,".",null,8,"vul in",6,"vul in",10,"vul in"]
[null,11,".",null,2,".",null,13,".",null,14,".",null,19,".",null,null,{"$f":"COUNTIF(R5:R13,\"juist\")","v":0},null,{"$f":"COUNTIF(T5:T13,\"juist\")","v":0},4,"vul in"]
[null,8,".",null,11,".",null,8,".",null,13,".",null,6,".",null,null,{"$f":"COUNTIF(R6:R14,\"fout\")","v":0},null,{"$f":"COUNTIF(T6:T14,\"fout\")","v":0},null,{"$f":"COUNTIF(V5:V14,\"juist\")","v":0}]
[null,null,{"$f":"IF(R14=9,\"Prima!\",IF(R15>=1,\"Oeps!\",\"\"))","v":""},null,null,{"$f":"IF(T14=9,\"Prima!\",IF(T15>=1,\"Oeps!\",\"\"))","v":""},null,14,".",null,8,".",null,11,".",null,null,null,null,null,null,{"$f":"COUNTIF(V5:V14,\"fout\")","v":0}]
[null,null,null,null,null,null,null,null,{"$f":"IF(V15=10,\"Prima!\",IF(V16>=1,\"Oeps!\",\"\"))","v":""},null,0,".",null,3,".",null,null,19,null,20]
[null,null,null,null,null,null,null,null,null,null,null,{"$f":"IF(R29=11,\"Prima!\",IF(R30>=1,\"Oeps!\",\"\"))","v":""},null,null,{"$f":"IF(T29=11,\"Prima!\",IF(T30=1,\"Oeps!\",\"\"))","v":""},null,9,{"$f":"IF(L7=Q18,\"juist\",IF(L7=\".\",\"vul in\",\"fout\"))","v":"vul in"},5,{"$f":"IF(O7=S18,\"juist\",IF(O7=\".\",\"vul in\",\"fout\"))","v":"vul in"}]
[null,null,null,null,null,null,null,null,null,null,null,null,null,null,null,null,4,{"$f":"IF(L8=Q19,\"juist\",IF(L8=\".\",\"vul in\",\"fout\"))","v":"vul in"},18,{"$f":"IF(O8=S19,\"juist\",IF(O8=\".\",\"vul in\",\"fout\"))","v":"vul in"}]
[null,null,null,null,null,null,null,null,null,null,null,null,null,null,null,null,16,"vul in",8,"vul in"]
[null,null,null,null,"totaal aantal punten",null,null,null,null,null,null,null,null,{"$f":"R14+T14+V15+R29+T29","v":0},"/50",null,2,"vul in",20,"vul in"]
[null,null,null,null,{"$f":"IF(O17=\".\",\"\",IF(N21<30,\"jammer, probeer nog een keer\",IF(N21<40,\"dit kan beter\",IF(N21=40,\"proficiat, dit heb je goed gedaan!\",IF(N21>40,\"proficiat, dit heb je goed gedaan!\",)))))","v":""},null,null,null,null,null,null,null,null,null,null,null,7,"vul in",13,"vul in"]
[null,null,null,null,null,null,null,null,null,null,null,null,null,null,null,null,15,"vul in",4,"vul in"]
[null,null,null,null,null,null,null,null,null,null,null,null,null,null,null,null,1,"vul in",10,"vul in"]
[null,null,null,null,null,null,null,null,null,null,null,null,null,null,null,null,5,"vul in",1,"vul in"]
[null,null,null,null,null,null,null,null,null,null,null,null,null,null,null,null,6,"vul in",14,"vul in"]
[null,null,null,null,null,null,null,null,null,null,null,null,null,null,null,null,11,"vul in",9,"vul in"]
[null,null,null,null,null,null,null,null,null,null,null,null,null,null,null,null,19,{"$f":"IF(L17=Q28,\"juist\",IF(L17=\".\",\"vul in\",\"fout\"))","v":"vul in"},17,"vul in"]
[null,null,null,null,null,null,null,null,null,null,null,null,null,null,null,null,null,{"$f":"COUNTIF(R18:R28,\"juist\")","v":0},null,{"$f":"COUNTIF(T18:T28,\"juist\")","v":0}]
[null,null,null,null,null,null,null,null,null,null,null,null,null,null,null,null,null,{"$f":"COUNTIF(R18:R28,\"fout\")","v":0},null,{"$f":"COUNTIF(T18:T28,\"fout\")","v":0}]

{"sheet":"S 10-20","index":6,"n_rows":30,"n_cols":18,"rows_kept":30,"cut":false,"hidden":false,"merged":[[1,1,1,17],[19,1,19,4],[20,7,20,15],[21,7,21,17]]}
[]
[null,"Splitsen 10 tot 20"]
[]
[]
[null,6,".",null,7,".",null,9,".",null,6,".",null,5,".",null,13,"."]
[]
[]
[null,9,".",null,15,".",null,5,".",null,15,".",null,3,".",null,6,"."]
[]
[]
[null,5,".",null,9,".",null,9,".",null,5,".",null,7,".",null,0,"."]
[]
[]
[null,11,".",null,8,".",null,7,".",null,12,".",null,3,".",null,10,"."]
[]
[]
[null,20,".",null,8,".",null,3,".",null,9,".",null,7,".",null,6,"."]
[]
[null,null,{"$f":"IF(C29=5,\"Prima!\",IF(C30>=1,\"Oeps!\",\"\"))","v":""},null,null,{"$f":"IF(F29=5,\"Prima!\",IF(F30>=1,\"Oeps!\",\"\"))","v":""},null,null,{"$f":"IF(I29=5,\"Prima!\",IF(I30>=1,\"Oeps!\",\"\"))","v":""},null,null,{"$f":"IF(L29=5,\"Prima!\",IF(L30>=1,\"Oeps!\",\"\"))","v":""},null,null,{"$f":"IF(O29=5,\"Prima!\",IF(O30>=1,\"Oeps!\",\"\"))","v":""},null,null,{"$f":"IF(R29=5,\"Prima!\",IF(R30>=1,\"Oeps!\",\"\"))","v":""}]
[]
[null,null,null,null,null,null,null,"Totaal aantal punten ",null,null,null,null,null,null,null,null,{"$f":"C29+F29+I29+L29+O29+R29","v":0},"/30"]
[null,null,null,null,null,null,null,{"$f":"IF(R17=\".\",\"\",IF(Q21<18,\"jammer, probeer nog een keer\",IF(Q21<24,\"dit kan beter\",IF(Q21=24,\"proficiat, dit heb je goed gedaan!\",IF(Q21>24,\"proficiat, dit heb je goed gedaan!\",)))))","v":""}]
[]
[null,6,{"$f":"IF(C5=B24, \"juist\", IF(C5=\".\",\"\",\"fout\"))","v":""},null,7,{"$f":"IF(F5=E24, \"juist\", IF(F5=\".\",\"\",\"fout\"))","v":""},null,6,{"$f":"IF(I5=H24, \"juist\", IF(I5=\".\",\"\",\"fout\"))","v":""},null,5,{"$f":"IF(L5=K24, \"juist\", IF(L5=\".\",\"\",\"fout\"))","v":""},null,15,{"$f":"IF(O5=N24, \"juist\", IF(O5=\".\",\"\",\"fout\"))","v":""},null,3,{"$f":"IF(R5=Q24, \"juist\", IF(R5=\".\",\"\",\"fout\"))","v":""}]
[null,9,{"$f":"IF(C8=B25, \"juist\", IF(C8=\".\",\"\",\"fout\"))","v":""},null,2,{"$f":"IF(F8=E25, \"juist\", IF(F8=\".\",\"\",\"fout\"))","v":""},null,8,{"$f":"IF(I8=H25, \"juist\", IF(I8=\".\",\"\",\"fout\"))","v":""},null,4,{"$f":"IF(L8=K25, \"juist\", IF(L8=\".\",\"\",\"fout\"))","v":""},null,9,{"$f":"IF(O8=N25, \"juist\", IF(O8=\".\",\"\",\"fout\"))","v":""},null,8,{"$f":"IF(R8=Q25, \"juist\", IF(R8=\".\",\"\",\"fout\"))","v":""}]
[null,10,{"$f":"IF(C11=B26, \"juist\", IF(C11=\".\",\"\",\"fout\"))","v":""},null,2,{"$f":"IF(F11=E26, \"juist\", IF(F11=\".\",\"\",\"fout\"))","v":""},null,11,{"$f":"IF(I11=H26, \"juist\", IF(I11=\".\",\"\",\"fout\"))","v":""},null,11,{"$f":"IF(L11=K26, \"juist\", IF(L11=\".\",\"\",\"fout\"))","v":""},null,11,{"$f":"IF(O11=N26, \"juist\", IF(O11=\".\",\"\",\"fout\"))","v":""},null,17,{"$f":"IF(R11=Q26, \"juist\", IF(R11=\".\",\"\",\"fout\"))","v":""}]
[null,2,{"$f":"IF(C14=B27, \"juist\", IF(C14=\".\",\"\",\"fout\"))","v":""},null,11,{"$f":"IF(F14=E27, \"juist\", IF(F14=\".\",\"\",\"fout\"))","v":""},null,5,{"$f":"IF(I14=H27, \"juist\", IF(I14=\".\",\"\",\"fout\"))","v":""},null,2,{"$f":"IF(L14=K27, \"juist\", IF(L14=\".\",\"\",\"fout\"))","v":""},null,12,{"$f":"IF(O14=N27, \"juist\", IF(O14=\".\",\"\",\"fout\"))","v":""},null,1,{"$f":"IF(R14=Q27, \"juist\", IF(R14=\".\",\"\",\"fout\"))","v":""}]
[null,0,{"$f":"IF(C17=B28, \"juist\", IF(C17=\".\",\"\",\"fout\"))","v":""},null,8,{"$f":"IF(F17=E28, \"juist\", IF(F17=\".\",\"\",\"fout\"))","v":""},null,15,{"$f":"IF(I17=H28, \"juist\", IF(I17=\".\",\"\",\"fout\"))","v":""},null,8,{"$f":"IF(L17=K28, \"juist\", IF(L17=\".\",\"\",\"fout\"))","v":""},null,6,{"$f":"IF(O17=N28, \"juist\", IF(O17=\".\",\"\",\"fout\"))","v":""},null,13,{"$f":"IF(R17=Q28, \"juist\", IF(R17=\".\",\"\",\"fout\"))","v":""}]
[null,null,{"$f":"COUNTIF(C24:C28,\"juist\")","v":0},null,null,{"$f":"COUNTIF(F24:F28,\"juist\")","v":0},null,null,{"$f":"COUNTIF(I24:I28,\"juist\")","v":0},null,null,{"$f":"COUNTIF(L24:L28,\"juist\")","v":0},null,null,{"$f":"COUNTIF(O24:O28,\"juist\")","v":0},null,null,{"$f":"COUNTIF(R24:R28,\"juist\")","v":0}]
[null,null,{"$f":"COUNTIF(C24:C28,\"fout\")","v":0},null,null,{"$f":"COUNTIF(F24:F28,\"fout\")","v":0},null,null,{"$f":"COUNTIF(I24:I28,\"fout\")","v":0},null,null,{"$f":"COUNTIF(L24:L28,\"fout\")","v":0},null,null,{"$f":"COUNTIF(O24:O28,\"fout\")","v":0},null,null,{"$f":"COUNTIF(R24:R28,\"fout\")","v":0}]

{"sheet":"S 0-20","index":7,"n_rows":31,"n_cols":21,"rows_kept":31,"cut":false,"hidden":false,"merged":[[29,7,29,12],[30,7,30,14],[28,1,28,4],[1,1,1,14]]}
[]
[null,"Splitsen 0 tot 20"]
[null,null,null,null,null,null,null,null,null,null,null,null,null,null,null,6,{"$f":"IF(C5=P3,\"juist\",IF(C5=\".\",\"vul in\",\"fout\"))","v":"vul in"},0,{"$f":"IF(F5=R3,\"juist\",IF(F5=\".\",\"vul in\",\"fout\"))","v":"vul in"},4,{"$f":"IF(I5=T3,\"juist\",IF(I5=\".\",\"vul in\",\"fout\"))","v":"vul in"}]
[null,null,null,null,null,null,null,null,null,null,null,null,null,null,null,5,{"$f":"IF(C8=P4,\"juist\",IF(C8=\".\",\"vul in\",\"fout\"))","v":"vul in"},10,{"$f":"IF(F8=R4,\"juist\",IF(F8=\".\",\"vul in\",\"fout\"))","v":"vul in"},12,{"$f":"IF(I8=T4,\"juist\",IF(I8=\".\",\"vul in\",\"fout\"))","v":"vul in"}]
[null,9,".",null,1,".",null,2,".",null,3,".",null,1,".",16,{"$f":"IF(C11=P5,\"juist\",IF(C11=\".\",\"vul in\",\"fout\"))","v":"vul in"},4,{"$f":"IF(F11=R5,\"juist\",IF(F11=\".\",\"vul in\",\"fout\"))","v":"vul in"},6,{"$f":"IF(I11=T5,\"juist\",IF(I11=\".\",\"vul in\",\"fout\"))","v":"vul in"}]
[null,null,null,null,null,null,null,null,null,null,null,null,null,null,null,1,{"$f":"IF(C14=P6,\"juist\",IF(C14=\".\",\"vul in\",\"fout\"))","v":"vul in"},12,{"$f":"IF(F14=R6,\"juist\",IF(F14=\".\",\"vul in\",\"fout\"))","v":"vul in"},1,{"$f":"IF(I14=T6,\"juist\",IF(I14=\".\",\"vul in\",\"fout\"))","v":"vul in"}]
[null,null,null,null,null,null,null,null,null,null,null,null,null,null,null,5,{"$f":"IF(C17=P7,\"juist\",IF(C17=\".\",\"vul in\",\"fout\"))","v":"vul in"},2,{"$f":"IF(F17=R7,\"juist\",IF(F17=\".\",\"vul in\",\"fout\"))","v":"vul in"},4,{"$f":"IF(I17=T7,\"juist\",IF(I17=\".\",\"vul in\",\"fout\"))","v":"vul in"}]
[null,2,".",null,2,".",null,6,".",null,3,".",null,3,".",5,{"$f":"IF(C17=P8,\"juist\",IF(C17=\".\",\"vul in\",\"fout\"))","v":"vul in"},2,{"$f":"IF(F17=R8,\"juist\",IF(F17=\".\",\"vul in\",\"fout\"))","v":"vul in"},5,{"$f":"IF(I20=T8,\"juist\",IF(I20=\".\",\"vul in\",\"fout\"))","v":"vul in"}]
[null,null,null,null,null,null,null,null,null,null,null,null,null,null,null,2,{"$f":"IF(C23=P9,\"juist\",IF(C23=\".\",\"vul in\",\"fout\"))","v":"vul in"},3,{"$f":"IF(F23=R9,\"juist\",IF(F23=\".\",\"vul in\",\"fout\"))","v":"vul in"},0,{"$f":"IF(I23=T9,\"juist\",IF(I23=\".\",\"vul in\",\"fout\"))","v":"vul in"}]
[null,null,null,null,null,null,null,null,null,null,null,null,null,null,null,8,{"$f":"IF(C26=P10,\"juist\",IF(C26=\".\",\"vul in\",\"fout\"))","v":"vul in"},0,{"$f":"IF(F26=R10,\"juist\",IF(F26=\".\",\"vul in\",\"fout\"))","v":"vul in"},13,{"$f":"IF(I26=T10,\"juist\",IF(I26=\".\",\"vul in\",\"fout\"))","v":"vul in"}]
[null,3,".",null,4,".",null,8,".",null,4,".",null,3,".",null,{"$f":"COUNTIF(Q3:Q10,\"juist\")","v":0},null,{"$f":"COUNTIF(S3:S10,\"juist\")","v":0},null,{"$f":"COUNTIF(U3:U10,\"juist\")","v":0}]
[null,null,null,null,null,null,null,null,null,null,null,null,null,null,null,null,{"$f":"COUNTIF(Q3:Q10,\"fout\")","v":0},null,{"$f":"COUNTIF(S3:S10,\"fout\")","v":0},null,{"$f":"COUNTIF(U3:U10,\"fout\")","v":0}]
[]
[null,1,".",null,8,".",null,2,".",null,13,".",null,7,".",7,{"$f":"IF(L5=P14,\"juist\",IF(L5=\".\",\"vul in\",\"fout\"))","v":"vul in"},4,{"$f":"IF(O5=R14,\"juist\",IF(O5=\".\",\"vul in\",\"fout\"))","v":"vul in"}]
[null,null,null,null,null,null,null,null,null,null,null,null,null,null,null,11,{"$f":"IF(L8=P15,\"juist\",IF(L8=\".\",\"vul in\",\"fout\"))","v":"vul in"},8,{"$f":"IF(O8=R15,\"juist\",IF(O8=\".\",\"vul in\",\"fout\"))","v":"vul in"}]
[null,null,null,null,null,null,null,null,null,null,null,null,null,null,null,2,{"$f":"IF(L11=P16,\"juist\",IF(L11=\".\",\"vul in\",\"fout\"))","v":"vul in"},5,{"$f":"IF(O11=R16,\"juist\",IF(O11=\".\",\"vul in\",\"fout\"))","v":"vul in"}]
[null,5,".",null,2,".",null,15,".",null,8,".",null,1,".",4,{"$f":"IF(L14=P17,\"juist\",IF(L14=\".\",\"vul in\",\"fout\"))","v":"vul in"},8,{"$f":"IF(O14=R17,\"juist\",IF(O14=\".\",\"vul in\",\"fout\"))","v":"vul in"}]
[null,null,null,null,null,null,null,null,null,null,null,null,null,null,null,4,{"$f":"IF(L17=P18,\"juist\",IF(L17=\".\",\"vul in\",\"fout\"))","v":"vul in"},8,{"$f":"IF(O17=R18,\"juist\",IF(O17=\".\",\"vul in\",\"fout\"))","v":"vul in"}]
[null,null,null,null,null,null,null,null,null,null,null,null,null,null,null,3,{"$f":"IF(L20=P19,\"juist\",IF(L20=\".\",\"vul in\",\"fout\"))","v":"vul in"},3,{"$f":"IF(O20=R19,\"juist\",IF(O20=\".\",\"vul in\",\"fout\"))","v":"vul in"}]
[null,6,".",null,8,".",null,4,".",null,17,".",null,1,".",3,{"$f":"IF(L23=P20,\"juist\",IF(L23=\".\",\"vul in\",\"fout\"))","v":"vul in"},1,{"$f":"IF(O23=R20,\"juist\",IF(O23=\".\",\"vul in\",\"fout\"))","v":"vul in"}]
[null,null,null,null,null,null,null,null,null,null,null,null,null,null,null,12,{"$f":"IF(L26=P21,\"juist\",IF(L26=\".\",\"vul in\",\"fout\"))","v":"vul in"},5,{"$f":"IF(O26=R21,\"juist\",IF(O26=\".\",\"vul in\",\"fout\"))","v":"vul in"}]
[null,null,null,null,null,null,null,null,null,null,null,null,null,null,null,null,{"$f":"COUNTIF(Q14:Q21,\"juist\")","v":0},null,{"$f":"COUNTIF(S14:S21,\"juist\")","v":0}]
[null,3,".",null,6,".",null,0,".",null,4,".",null,17,".",null,{"$f":"COUNTIF(Q14:Q21,\"fout\")","v":0},null,{"$f":"COUNTIF(S14:S21,\"fout\")","v":0}]
[]
[]
[null,9,".",null,11,".",null,3,".",null,1,".",null,1,"."]
[]
[null,null,{"$f":"IF(Q11=8,\"Prima!\",IF(Q12>=1,\"Oeps!\",\"\"))","v":""},null,null,{"$f":"IF(S11=8,\"Prima!\",IF(S12>=1,\"Oeps!\",\"\"))","v":""},null,null,{"$f":"IF(U11=8,\"Prima!\",IF(U12>=1,\"Oeps!\",\"\"))","v":""},null,null,{"$f":"IF(Q22=8,\"Prima!\",IF(Q23>=1,\"Oeps!\",\"\"))","v":""},null,null,{"$f":"IF(S22=8,\"Prima!\",IF(S23>=1,\"Oeps!\",\"\"))","v":""}]
[]
[null,null,null,null,null,null,null,"Totaal aantal punten ",null,null,null,null,null,{"$f":"Q11+S11+U11+Q22+S22","v":0},"/40"]
[null,null,null,null,null,null,null,{"$f":"IF(O26=\".\",\"\",IF(N30<24,\"jammer, probeer nog een keer\",IF(N30<32,\"dit kan beter\",IF(N30=32,\"proficiat, dit heb je goed gedaan!\",IF(N30>32,\"proficiat, dit heb je goed gedaan!\",)))))","v":""}]

{"sheet":"Brug over 10","index":8,"n_rows":18,"n_cols":12,"rows_kept":18,"cut":false,"hidden":false,"merged":[[1,1,1,8],[15,1,15,8],[14,1,14,5]]}
[]
[null,"Brug over 10",null,null,null,null,null,null,null,null,null,{"$f":"COUNTIF(E4:E13,\"Prima!\")","v":0}]
[null,null,null,null,null,null,null,null,null,null,null,{"$f":"COUNTIF(I4:I13,\"Prima!\")","v":0}]
[null,"8 + 3 =",".",11,{"$f":"IF(C4=D4, \"Prima!\", IF(C4=\".\", \"\", IF(C4<>D4, \"Oeps!\",)))","v":""},"6 + 3 =",".",9,{"$f":"IF(G4=H4, \"Prima!\", IF(G4=\".\", \"\", IF(G4<>H4, \"Oeps!\",)))","v":""}]
[null,"4 + 7 =",".",11,{"$f":"IF(C5=D5, \"Prima!\", IF(C5=\".\", \"\", IF(C5<>D5, \"Oeps!\",)))","v":""},"5 + 6 =",".",11,{"$f":"IF(G5=H5, \"Prima!\", IF(G5=\".\", \"\", IF(G5<>H5, \"Oeps!\",)))","v":""}]
[null,"9 + 6 =",".",15,"","4 + 9 =",".",13,""]
[null,"6 + 8 =",".",14,"","5 + 5 =",".",10,""]
[null,"7 + 7 =",".",14,"","3 + 8 = ",".",11,""]
[null,"3 + 9 =",".",12,"","7 + 6 =",".",13,""]
[null,"4 + 8 =",".",12,"","8 + 7 = ",".",15,""]
[null,"2 + 9 =",".",11,"","10 + 4 =",".",14,""]
[null,"6 + 4 =",".",10,"","6 + 6 =",".",12,""]
[null,"5 + 8 =",".",13,"","5 + 6 = ",".",11,""]
[]
[null,"totaal aantal punten ",null,null,null,null,{"$f":"L3+L2","v":0},null,"/20"]
[null,{"$f":"IF(G13=\".\", \"\",  IF(G15 <12, \"jammer, probeer nog een keer\", IF(G15 <16, \"dit kan beter\", IF(G15=16, \"proficiat, dit heb je goed gedaan!\", IF(G15 >16, \"proficiat, dit heb je goed gedaan!\", )))))","v":""}]
[]
[null,null,null,null,null,"."]

{"sheet":"E+E","index":9,"n_rows":16,"n_cols":11,"rows_kept":16,"cut":false,"hidden":false,"merged":[[1,1,1,8],[14,1,14,5],[15,1,15,8]]}
[]
[null,"E + E",null,null,null,null,null,null,null,null,{"$f":"COUNTIF(E4:E13,\"Prima!\")","v":1}]
[null,null,null,null,null,null,null,null,null,null,{"$f":"COUNTIF(I4:I13,\"Prima!\")","v":0}]
[null,"1 + 3 =",4,4,{"$f":"IF(C4=D4, \"Prima!\", IF(C4=\".\", \"\", IF(C4<>D4, \"Oeps!\",)))","v":"Prima!"},"2 + 0 =",".",2,{"$f":"IF(G4=H4, \"Prima!\", IF(G4=\".\", \"\", IF(G4<>H4, \"Oeps!\",)))","v":""}]
[null,"4 + 5 =",".",9,{"$f":"IF(C5=D5, \"Prima!\", IF(C5=\".\", \"\", IF(C5<>D5, \"Oeps!\",)))","v":""},"4 + 2 =",".",6,{"$f":"IF(G5=H5, \"Prima!\", IF(G5=\".\", \"\", IF(G5<>H5, \"Oeps!\",)))","v":""}]
[null,"2 + 8 =",".",10,"","1 + 3 =",".",4,""]
[null,"6 + 3 =",".",9,"","2 + 5 =",".",7,""]
[null,"5 + 1 =",".",6,"","9 + 1 =",".",10,""]
[null,"0 + 6 =",".",6,"","5 + 1 =",".",6,""]
[null,"3 + 2 =",".",5,"","3 + 0 =",".",3,""]
[null,"6 + 2 =",".",8,"","0 + 8 =",".",8,""]
[null,"7 + 2 =",".",9,"","3 + 3 =",".",6,""]
[null,"8 + 1 =",".",9,"","1 + 0 =",".",1,""]
[]
[null,"totaal aantal punten ",null,null,null,null,{"$f":"K3+K2","v":1},null,"/20"]
[null,{"$f":"IF(G13=\".\", \"\",  IF(G15 <12, \"jammer, probeer nog een keer\", IF(G15 <16, \"dit kan beter\", IF(G15=16, \"proficiat, dit heb je goed gedaan!\", IF(G15 >16, \"proficiat, dit heb je goed gedaan!\", )))))","v":""}]

{"sheet":"T+E","index":10,"n_rows":16,"n_cols":12,"rows_kept":16,"cut":false,"hidden":false,"merged":[[1,1,1,8],[14,1,14,5],[15,1,15,8]]}
[]
[null,"T + E",null,null,null,null,null,null,null,null,null,{"$f":"COUNTIF(E4:E13,\"Prima!\")","v":0}]
[null,null,null,null,null,null,null,null,null,null,null,{"$f":"COUNTIF(I4:I13,\"Prima!\")","v":0}]
[null,"10 + 2 =",".",12,{"$f":"IF(C4=D4, \"Prima!\", IF(C4=\".\", \"\", IF(C4<>D4, \"Oeps!\",)))","v":""},"10 + 2 =",".",12,{"$f":"IF(G4=H4, \"Prima!\", IF(G4=\".\", \"\", IF(G4<>H4, \"Oeps!\",)))","v":""}]
[null,"10 + 5 =",".",15,{"$f":"IF(C5=D5, \"Prima!\", IF(C5=\".\", \"\", IF(C5<>D5, \"Oeps!\",)))","v":""},"20 + 2 =",".",22,{"$f":"IF(G5=H5, \"Prima!\", IF(G5=\".\", \"\", IF(G5<>H5, \"Oeps!\",)))","v":""}]
[null,"10 + 6 =",".",16,"","20 + 0 = ",".",20,"",null,null,"."]
[null,"10 + 3 =",".",13,"","20 + 9 =",".",29,""]
[null,"10 + 0 =",".",10,"","20 + 3 =",".",23,""]
[null,"10 + 1 =",".",11,"","20 + 5 =",".",25,""]
[null,"10 + 9 =",".",19,"","20 + 7 =",".",27,""]
[null,"10 + 7 =",".",17,"","20 + 4 =",".",24,""]
[null,"10 + 4 = ",".",14,"","20 + 1 =",".",21,""]
[null,"10 + 8 =",".",18,"","20 + 8 =",".",28,""]
[]
[null,"totaal aantal punten ",null,null,null,null,{"$f":"L3+L2","v":0},null,"/20"]
[null,{"$f":"IF(G13=\".\", \"\",  IF(G15 <12, \"jammer, probeer nog een keer\", IF(G15 <16, \"dit kan beter\", IF(G15=16, \"proficiat, dit heb je goed gedaan!\", IF(G15 >16, \"proficiat, dit heb je goed gedaan!\", )))))","v":""}]

{"sheet":"TE + E","index":11,"n_rows":16,"n_cols":12,"rows_kept":16,"cut":false,"hidden":false,"merged":[[1,1,1,8],[14,1,14,5],[15,1,15,8]]}
[]
[null,"TE + E",null,null,null,null,null,null,null,null,null,{"$f":"COUNTIF(E4:E13,\"Prima!\")","v":0}]
[null,null,null,null,null,null,null,null,null,null,null,{"$f":"COUNTIF(I4:I13,\"Prima!\")","v":0}]
[null,"11 + 3 =",".",14,{"$f":"IF(C4=D4, \"Prima!\", IF(C4=\".\", \"\", IF(C4<>D4, \"Oeps!\",)))","v":""},"11 + 0 =",".",11,{"$f":"IF(G4=H4, \"Prima!\", IF(G4=\".\", \"\", IF(G4<>H4, \"Oeps!\",)))","v":""}]
[null,"15 + 4 =",".",19,{"$f":"IF(C5=D5, \"Prima!\", IF(C5=\".\", \"\", IF(C5<>D5, \"Oeps!\",)))","v":""},"19 + 1 =",".",20,{"$f":"IF(G5=H5, \"Prima!\", IF(G5=\".\", \"\", IF(G5<>H5, \"Oeps!\",)))","v":""}]
[null,"11 + 2 =",".",13,"","12 + 7 = ",".",19,"","."]
[null,"17 + 1 =",".",18,"","11 + 4  = ",".",15,""]
[null,"12 + 2 =",".",14,"","16 + 2 =",".",18,""]
[null,"13 + 4 =",".",17,"","10 + 3 =",".",13,""]
[null,"18 + 1 =",".",19,"","12 + 4 = ",".",16,""]
[null,"14 + 2 =",".",16,"","14 + 0 =",".",14,""]
[null,"11 + 7 = ",".",18,"","11 + 1 =",".",12,""]
[null,"16 + 1 =",".",17,"","14 + 5 =",".",19,""]
[]
[null,"totaal aantal punten ",null,null,null,null,{"$f":"L3+L2","v":0},null,"/20"]
[null,{"$f":"IF(G13=\".\", \"\",  IF(G15 <12, \"jammer, probeer nog een keer\", IF(G15 <16, \"dit kan beter\", IF(G15=16, \"proficiat, dit heb je goed gedaan!\", IF(G15 >16, \"proficiat, dit heb je goed gedaan!\", )))))","v":""}]

{"sheet":"O gemengd","index":12,"n_rows":18,"n_cols":16,"rows_kept":18,"cut":false,"hidden":false,"merged":[[1,1,1,12],[14,1,14,9],[15,1,15,12]]}
[]
[null,"Gemengd OPTELLEN",null,null,null,null,null,null,null,null,null,null,null,null,null,{"$f":"COUNTIF(E4:E13,\"Prima!\")","v":0}]
[null,null,null,null,null,null,null,null,null,null,null,null,null,null,null,{"$f":"COUNTIF(I4:I13,\"Prima!\")","v":0}]
[null,"3 + 6 =",".",9,{"$f":"IF(C4=D4, \"Prima!\", IF(C4=\".\", \"\", IF(C4<>D4, \"Oeps!\",)))","v":""},"11 + 8 =",".",19,{"$f":"IF(G4=H4, \"Prima!\", IF(G4=\".\", \"\", IF(G4<>H4, \"Oeps!\",)))","v":""},"10 + 6 =",".",16,{"$f":"IF(K4=L4, \"Prima!\", IF(K4=\".\", \"\", IF(K4<>L4, \"Oeps!\",)))","v":""},null,null,{"$f":"COUNTIF(M4:M13,\"Prima!\")","v":0}]
[null,"10 + 2 =",".",12,{"$f":"IF(C5=D5, \"Prima!\", IF(C5=\".\", \"\", IF(C5<>D5, \"Oeps!\",)))","v":""},"20 + 1 =",".",21,{"$f":"IF(G5=H5, \"Prima!\", IF(G5=\".\", \"\", IF(G5<>H5, \"Oeps!\",)))","v":""},"0 + 5 =",".",5,{"$f":"IF(K5=L5, \"Prima!\", IF(K5=\".\", \"\", IF(K5<>L5, \"Oeps!\",)))","v":""}]
[null,"6 + 2 =",".",8,"","7 + 0 =",".",7,"","16 + 4 =",".",20,""]
[null,"1 + 6 =",".",7,"","14 + 2 =",".",16,"","8 + 2 =",".",10,""]
[null,"11 + 5 =",".",16,"","4 + 1 =",".",5,"","10 + 0 =",".",10,""]
[null,"5 + 3 =",".",8,"","10 + 7 =",".",17,"","13 + 4 =",".",17,""]
[null,"12 + 7 =",".",19,"","7 + 2 =",".",9,"","4 + 3 =",".",7,""]
[null,"10 + 5 =",".",15,"","15 + 3 =",".",18,"","12 + 2 =",".",14,""]
[null,"4 + 4 =",".",8,"","1 + 5 =",".",6,"","3 + 6 =",".",9,""]
[null,"18 + 1 =",".",19,"","10 + 8 =",".",18,"","10 + 9 =",".",19,""]
[]
[null,"totaal aantal punten ",null,null,null,null,null,null,null,null,{"$f":"P3+P2+P4","v":0},null,"/30"]
[null,{"$f":"IF(K13=\".\", \"\",  IF(K15 <18, \"jammer, probeer nog een keer\", IF(K15 <24, \"dit kan beter\", IF(K15=24, \"proficiat, dit heb je goed gedaan!\", IF(K15 >24, \"proficiat, dit heb je goed gedaan!\", )))))","v":""}]
[]
[null,null,null,null,null,"."]

{"sheet":"E-E","index":13,"n_rows":16,"n_cols":11,"rows_kept":16,"cut":false,"hidden":false,"merged":[[1,1,1,8],[14,1,14,5],[15,1,15,8]]}
[]
[null,"E - E",null,null,null,null,null,null,null,null,{"$f":"COUNTIF(E4:E13,\"Prima!\")","v":1}]
[null,null,null,null,null,null,null,null,null,null,{"$f":"COUNTIF(I4:I13,\"Prima!\")","v":0}]
[null,"6 - 2 =",4,4,{"$f":"IF(C4=D4, \"Prima!\", IF(C4=\".\", \"\", IF(C4<>D4, \"Oeps!\",)))","v":"Prima!"},"9 - 6 = ",".",3,{"$f":"IF(G4=H4, \"Prima!\", IF(G4=\".\", \"\", IF(G4<>H4, \"Oeps!\",)))","v":""}]
[null,"9 - 4 =",".",5,{"$f":"IF(C5=D5, \"Prima!\", IF(C5=\".\", \"\", IF(C5<>D5, \"Oeps!\",)))","v":""},"2 - 0 =",".",2,{"$f":"IF(G5=H5, \"Prima!\", IF(G5=\".\", \"\", IF(G5<>H5, \"Oeps!\",)))","v":""}]
[null,"2 - 1 = ",".",1,"","7 - 6 =",".",1,""]
[null,"8 - 6 =",".",2,"","3 - 0 =",".",3,""]
[null,"3 - 1 =",".",2,"","4 - 2 =",".",2,""]
[null," 5 - 3 = ",".",2,"","6 - 5 =",".",1,""]
[null,"7 - 3 =",".",4,"","1 - 1 =",".",0,""]
[null,"4 - 3 = ",".",1,"","8 - 3 =",".",5,""]
[null,"8 - 8 =",".",0,"","7 - 5 =",".",2,""]
[null,"5 - 1 =",".",4,"","9 - 2 =",".",7,""]
[]
[null,"totaal aantal punten ",null,null,null,null,{"$f":"K3+K2","v":1},null,"/20"]
[null,{"$f":"IF(G13=\".\", \"\",  IF(G15 <12, \"jammer, probeer nog een keer\", IF(G15 <16, \"dit kan beter\", IF(G15=16, \"proficiat, dit heb je goed gedaan!\", IF(G15 >16, \"proficiat, dit heb je goed gedaan!\", )))))","v":""}]

{"sheet":"T - E","index":14,"n_rows":16,"n_cols":11,"rows_kept":16,"cut":false,"hidden":false,"merged":[[1,1,1,8],[14,1,14,5],[15,1,15,8]]}
[]
[null,"T - E",null,null,null,null,null,null,null,null,{"$f":"COUNTIF(E4:E13,\"Prima!\")","v":1}]
[null,null,null,null,null,null,null,null,null,null,{"$f":"COUNTIF(I4:I13,\"Prima!\")","v":0}]
[null,"10 - 3 =",7,7,{"$f":"IF(C4=D4, \"Prima!\", IF(C4=\".\", \"\", IF(C4<>D4, \"Oeps!\",)))","v":"Prima!"},"20 - 6 = ",".",14,{"$f":"IF(G4=H4, \"Prima!\", IF(G4=\".\", \"\", IF(G4<>H4, \"Oeps!\",)))","v":""}]
[null,"10 - 6 = ",".",4,{"$f":"IF(C5=D5, \"Prima!\", IF(C5=\".\", \"\", IF(C5<>D5, \"Oeps!\",)))","v":""},"20 - 0 =",".",20,{"$f":"IF(G5=H5, \"Prima!\", IF(G5=\".\", \"\", IF(G5<>H5, \"Oeps!\",)))","v":""}]
[null,"10 - 0 =",".",10,"","20 - 7 =",".",13,""]
[null,"10 - 5 =",".",5,"","20 - 3 =",".",17,""]
[null,"10 - 8 =",".",2,"","20 - 9 =",".",11,""]
[null,"10 - 1 =",".",9,"","20 - 2 =",".",18,""]
[null,"10 - 7 =",".",3,"","20 - 5 =",".",15,""]
[null,"10 - 2 =",".",8,"","20 - 8 =",".",12,""]
[null,"10 - 9 =",".",1,"","20 - 1 =",".",19,""]
[null,"10 - 4 =",".",6,"","20 - 4 =",".",16,""]
[]
[null,"totaal aantal punten ",null,null,null,null,{"$f":"K3+K2","v":1},null,"/20"]
[null,{"$f":"IF(G13=\".\", \"\",  IF(G15 <12, \"jammer, probeer nog een keer\", IF(G15 <16, \"dit kan beter\", IF(G15=16, \"proficiat, dit heb je goed gedaan!\", IF(G15 >16, \"proficiat, dit heb je goed gedaan!\", )))))","v":""}]

{"sheet":"Brug over 10 min","index":15,"n_rows":16,"n_cols":11,"rows_kept":16,"cut":false,"hidden":false,"merged":[[1,1,1,8],[14,1,14,5],[15,1,15,8]]}
[]
[null,"Brug over 10",null,null,null,null,null,null,null,null,{"$f":"COUNTIF(E4:E13,\"Prima!\")","v":1}]
[null,null,null,null,null,null,null,null,null,null,{"$f":"COUNTIF(I4:I13,\"Prima!\")","v":0}]
[null,"15 - 6 =",9,9,{"$f":"IF(C4=D4, \"Prima!\", IF(C4=\".\", \"\", IF(C4<>D4, \"Oeps!\",)))","v":"Prima!"},"11 - 4 =",".",7,{"$f":"IF(G4=H4, \"Prima!\", IF(G4=\".\", \"\", IF(G4<>H4, \"Oeps!\",)))","v":""}]
[null,"16 - 8 =",".",8,{"$f":"IF(C5=D5, \"Prima!\", IF(C5=\".\", \"\", IF(C5<>D5, \"Oeps!\",)))","v":""},"18 - 9 =",".",9,{"$f":"IF(G5=H5, \"Prima!\", IF(G5=\".\", \"\", IF(G5<>H5, \"Oeps!\",)))","v":""}]
[null,"13 - 4 =",".",9,"","15 - 7 =",".",8,""]
[null,"11 - 10 =",".",1,"","13 - 6 =",".",7,""]
[null,"14 - 8 =",".",6,"","15 - 8 =",".",7,""]
[null,"10 - 6 =",".",4,"","11 - 3 =",".",8,""]
[null,"12 - 8 =",".",4,"","14 - 6 =",".",8,""]
[null,"19 - 10 =",".",9,"","12 - 9 =",".",3,""]
[null,"14 - 5 =",".",9,"","17 - 8 =",".",9,""]
[null,"13 - 9 =",".",4,"","12 - 6 =",".",6,""]
[]
[null,"totaal aantal punten ",null,null,null,null,{"$f":"K3+K2","v":1},null,"/20"]
[null,{"$f":"IF(G13=\".\", \"\",  IF(G15 <12, \"jammer, probeer nog een keer\", IF(G15 <16, \"dit kan beter\", IF(G15=16, \"proficiat, dit heb je goed gedaan!\", IF(G15 >16, \"proficiat, dit heb je goed gedaan!\", )))))","v":""}]

{"sheet":"TE - T","index":16,"n_rows":16,"n_cols":11,"rows_kept":16,"cut":false,"hidden":false,"merged":[[1,1,1,8],[14,1,14,5],[15,1,15,8]]}
[]
[null,"TE - T",null,null,null,null,null,null,null,null,{"$f":"COUNTIF(E4:E13,\"Prima!\")","v":1}]
[null,null,null,null,null,null,null,null,null,null,{"$f":"COUNTIF(I4:I13,\"Prima!\")","v":0}]
[null,"16 - 10 =",6,6,{"$f":"IF(C4=D4, \"Prima!\", IF(C4=\".\", \"\", IF(C4<>D4, \"Oeps!\",)))","v":"Prima!"},"22 - 10 = ",".",12,{"$f":"IF(G4=H4, \"Prima!\", IF(G4=\".\", \"\", IF(G4<>H4, \"Oeps!\",)))","v":""}]
[null,"11 - 10 =",".",1,{"$f":"IF(C5=D5, \"Prima!\", IF(C5=\".\", \"\", IF(C5<>D5, \"Oeps!\",)))","v":""},"25 - 10 =",".",15,{"$f":"IF(G5=H5, \"Prima!\", IF(G5=\".\", \"\", IF(G5<>H5, \"Oeps!\",)))","v":""}]
[null,"10 - 10 =",".",0,"","28 - 10 =",".",18,""]
[null,"13 - 10 =",".",3,"","24 - 10 =",".",14,""]
[null,"18 - 10 =",".",8,"","21 - 10 =",".",11,""]
[null,"14 - 10 =",".",4,"","20 - 10 = ",".",10,""]
[null,"17 - 10 = ",".",7,"","26 - 10 =",".",16,""]
[null,"12 - 10 =",".",2,"","23 - 10 =",".",13,""]
[null,"19 - 10 =",".",9,"","29 - 10 =",".",19,""]
[null,"15 - 10 =",".",5,"","27 - 10 =",".",17,""]
[]
[null,"totaal aantal punten ",null,null,null,null,{"$f":"K3+K2","v":1},null,"/20"]
[null,{"$f":"IF(G13=\".\", \"\",  IF(G15 <12, \"jammer, probeer nog een keer\", IF(G15 <16, \"dit kan beter\", IF(G15=16, \"proficiat, dit heb je goed gedaan!\", IF(G15 >16, \"proficiat, dit heb je goed gedaan!\", )))))","v":""}]

{"sheet":"TE - TE","index":17,"n_rows":16,"n_cols":11,"rows_kept":16,"cut":false,"hidden":false,"merged":[[1,1,1,8],[14,1,14,5],[15,1,15,8]]}
[]
[null,"TE - TE",null,null,null,null,null,null,null,null,{"$f":"COUNTIF(E4:E13,\"Prima!\")","v":1}]
[null,null,null,null,null,null,null,null,null,null,{"$f":"COUNTIF(I4:I13,\"Prima!\")","v":0}]
[null,"17 - 12 = ",5,5,{"$f":"IF(C4=D4, \"Prima!\", IF(C4=\".\", \"\", IF(C4<>D4, \"Oeps!\",)))","v":"Prima!"},"20 - 13 =",".",7,{"$f":"IF(G4=H4, \"Prima!\", IF(G4=\".\", \"\", IF(G4<>H4, \"Oeps!\",)))","v":""}]
[null,"11 - 11 =",".",0,{"$f":"IF(C5=D5, \"Prima!\", IF(C5=\".\", \"\", IF(C5<>D5, \"Oeps!\",)))","v":""},"15 - 11 =",".",4,{"$f":"IF(G5=H5, \"Prima!\", IF(G5=\".\", \"\", IF(G5<>H5, \"Oeps!\",)))","v":""}]
[null,"20 - 19 =",".",1,"","18 - 13 =",".",5,""]
[null,"14 - 12 =",".",2,"","13 - 10 =",".",3,""]
[null,"18 - 15 =",".",3,"","19 - 11 =",".",8,""]
[null,"13 - 11 =",".",2,"","12 - 11 =",".",1,""]
[null,"16 - 12 =",".",4,"","18 - 17 =",".",1,""]
[null,"12 - 12 =",".",0,"","16 - 11 =",".",5,""]
[null,"19 - 16 =",".",3,"","14 - 13 =",".",1,""]
[null,"15 - 14 =",".",1,"","17 - 13 =",".",4,""]
[]
[null,"totaal aantal punten ",null,null,null,null,{"$f":"K3+K2","v":1},null,"/20"]
[null,{"$f":"IF(G13=\".\", \"\",  IF(G15 <12, \"jammer, probeer nog een keer\", IF(G15 <16, \"dit kan beter\", IF(G15=16, \"proficiat, dit heb je goed gedaan!\", IF(G15 >16, \"proficiat, dit heb je goed gedaan!\", )))))","v":""}]

{"sheet":"A gemengd","index":18,"n_rows":17,"n_cols":19,"rows_kept":17,"cut":false,"hidden":false,"merged":[[1,1,1,16],[14,1,14,13],[15,1,15,16]]}
[]
[null,"Gemengd AFTREKKEN",null,null,null,null,null,null,null,null,null,null,null,null,null,null,null,null,{"$f":"COUNTIF(E4:E13,\"Prima!\")","v":0}]
[null,null,null,null,null,null,null,null,null,null,null,null,null,null,null,{"$f":"COUNTIF(I4:I13,\"Prima!\")","v":0},null,null,{"$f":"COUNTIF(I4:I13,\"Prima!\")","v":0}]
[null,"16 - 14 = ",".",2,{"$f":"IF(C4=D4, \"Prima!\", IF(C4=\".\", \"\", IF(C4<>D4, \"Oeps!\",)))","v":""},"20 - 5 =",".",15,{"$f":"IF(G4=H4, \"Prima!\", IF(G4=\".\", \"\", IF(G4<>H4, \"Oeps!\",)))","v":""},"16 - 9 =",".",7,{"$f":"IF(K4=L4, \"Prima!\", IF(K4=\".\", \"\", IF(K4<>L4, \"Oeps!\",)))","v":""},"17 - 12 =",".",5,{"$f":"IF(O4=P4, \"Prima!\", IF(O4=\".\", \"\", IF(O4<>P4, \"Oeps!\",)))","v":""},null,{"$f":"COUNTIF(M4:M13,\"Prima!\")","v":0}]
[null,"9 - 7 =",".",2,{"$f":"IF(C5=D5, \"Prima!\", IF(C5=\".\", \"\", IF(C5<>D5, \"Oeps!\",)))","v":""},"7 - 4 =",".",3,{"$f":"IF(G5=H5, \"Prima!\", IF(G5=\".\", \"\", IF(G5<>H5, \"Oeps!\",)))","v":""},"26 - 10 =",".",16,{"$f":"IF(K5=L5, \"Prima!\", IF(K5=\".\", \"\", IF(K5<>L5, \"Oeps!\",)))","v":""},"10 - 5 =",".",5,{"$f":"IF(O5=P5, \"Prima!\", IF(O5=\".\", \"\", IF(O5<>P5, \"Oeps!\",)))","v":""},null,{"$f":"COUNTIF(Q4:Q13,\"Prima!\")","v":0}]
[null,"15 - 2 =",".",13,"","19 - 2 =",".",17,"","3 - 1 =",".",2,"","13 - 10 =",".",3,""]
[null,"20 - 4 =",".",16,"","15 - 8 =",".",7,"","17 - 9 =",".",8,"","8 - 5 =",".",3,""]
[null,"18 - 15 =",".",3,"","12 - 6 =",".",6,"","20 - 0 =",".",20,"","16 - 10 =",".",6,""]
[null,"1 - 0 =",".",1,"","28 - 10 =",".",18,"","14 - 5 =",".",9,"","13 - 7 =",".",6,""]
[null,"15 - 9 =",".",6,"","12 - 11 =",".",1,"","10 - 1 =",".",9,"","12 - 5 =",".",7,""]
[null,"18 - 5 =",".",13,"","13 - 1 =",".",12,"","19 - 8 =",".",11,"","10 - 9 =",".",1,""]
[null,"20 - 10 =",".",10,"","18 - 10 =",".",8,"","10 - 10 =",".",0,"","16 - 8 =",".",8,""]
[null,"17 - 6 =",".",11,"","10 - 6 =",".",4,"","6 - 3 =",".",3,"","14 - 2 =",".",12,""]
[]
[null,"totaal aantal punten ",null,null,null,null,null,null,null,null,null,null,null,null,{"$f":"S3+S2+S4+S5","v":0},null,"/40"]
[null,{"$f":"IF(O13=\".\", \"\",  IF(O15 <24, \"jammer, probeer nog een keer\", IF(O15 <32, \"dit kan beter\", IF(O15=32, \"proficiat, dit heb je goed gedaan!\", IF(O15 >32, \"proficiat, dit heb je goed gedaan!\", )))))","v":""}]
[null,"."]